تداخل‌سنجی خط مبنای بسیار طویل
preferred label: very long baseline interferometry @en
type: Concept
related: تداخل‌سنجی

تداخل‌سنجی
scope note: اسبابی که پدیده حاصل از تداخل دو دسته نور را مورد استفاده قرار داده و با شکستن نور واحدی طول موج نور و تجزیه طیف نور را مود مطالعه قرار می‌دهد.
related: تداخل‌سنجی خط مبنای بسیار طویل
preferred label: interferometry @en
type: Concept