تخلخل
preferred label: porosity @en
type: Concept
narrower: تخلخل بینِ‏دانه‏ای

تخلخل بینِ‏دانه‏ای
scope note: تخلخل بین دانه‏ها یا اجزای یک سنگ، مانند سنگ‏آوارها و زیست‏آوارها
broader: تخلخل
preferred label: intergranular porosity @en
type: Concept