تپه رودپیچی
scope note: تپه‌ای که یک رودپیچ آن را کاملاً یا تقریباً احاطه کرده است
related: رودپیچ
preferred label: meander core @en
type: Concept

رودپیچ
preferred label: meander @en
type: Concept
related: تپه رودپیچی