پس‌لایه
scope note: لایۀ مایلی که در زمان رسوب‌گذاری به سمت بالادست جریان شیب پیدا کرده است
related: پیش‌لایه
preferred label: backset bed @en
type: Concept

پیش‌لایه
preferred label: foreset bed @en
type: Concept
related: پس‌لایه