گروه بولاوایان
scope note: دگرشیبی‌های شدید آنرا از سیستم های روپوشانی و زیر پوشانی (شاموایان و سباکویان) جدا می‌کند
related: زیمبابوه
broader: آرکئن
preferred label: Bulawayan Group @en
type: Concept

زیمبابوه
preferred label: Zimbabwe @en
type: Concept
related: گروه بولاوایان

آرکئن
preferred label: Archean @en
type: Concept
narrower: گروه بولاوایان