هادرینین
preferred label: Hadrynian @en
type: Concept
narrower: گروه فورکو

گروه فورکو
scope note: هادرینین بالایی. جزیره کیپ برتون،شمال نووااسکوتیا.
broader: هادرینین
preferred label: Fourchu Group @en
type: Concept