اردویسین میانی
preferred label: Middle Ordovician @en
type: Concept
narrower: کازیان

کازیان
scope note: شمال آمریکا. زیر موهاوکین و بالای اردویسین زیرین.
broader: اردویسین میانی
preferred label: Chazyan @en
type: Concept