دونین فوقانی
preferred label: Upper Devonian @en
type: Concept
narrower: استرونین

استرونین
scope note: از تقسیمات چینه نگاری که در مرز دونین و کربونیفر اتفاق افتاده است.
broader: دونین فوقانی
preferred label: Strunian @en
type: Concept