دونین فوقانی
preferred label: Upper Devonian @en
type: Concept
narrower: سازند پری

سازند پری
scope note: تشکیل شده از سکانس ضخیمی از رسوبات آواری دانه‌دار شامل لایه‌های تداخلی (درهم رفته) جریانهای بازالتی. مرکز پنسیلوانیا
related: پنسیلوانیا
broader: دونین فوقانی
preferred label: Perry Formation @en
type: Concept

پنسیلوانیا
preferred label: Pennsylvania @en
type: Concept
related: سازند پری