گرانیت آکلی
scope note: در جنوب جزایر نیوفاوندلند در دهانه رود سنت لورنس شمال اتازونی
related: جزیره نیوفوندلند
broader: دونین
preferred label: Ackley Granite @en
type: Concept

جزیره نیوفوندلند
preferred label: Newfoundland Island @en
type: Concept
related: گرانیت آکلی

دونین
preferred label: Devonian @en
type: Concept
narrower: گرانیت آکلی