سازند آلبرت
scope note: با قدمت کربونیفر واقع در نیوبرونشویک کانادا
broader: کربونیفر
preferred label: Albert Formation @en
type: Concept

کربونیفر
preferred label: Carboniferous @en
type: Concept
narrower: سازند آلبرت