مروستاماتا
preferred label: Merostomata @en
type: Concept
narrower: یوری پتریدا

یوری پتریدا
scope note: راسته ای از عنکبوتیان که امروزه از میان رفته اند. از برخی جهات شبیه عقرب و آبزی بوده اند.
broader: مروستاماتا
preferred label: Eurypterida @en
type: Concept