مندیبولاتا
preferred label: Mandibulata @en
type: Concept
narrower: ده هزار پائیان

ده هزار پائیان
scope note: شامل رده های آرکی پولی پودا، کیلوپودا، دیپلودا، پاروپودا و سیمفیا است. رده ای از بندپائیان با بدنی دراز و پاهای بسیار و سری مشخص و دارای یک جفت آنتن ماندیبول و حداقل یک جفت آرواره هستند.
broader: مندیبولاتا
preferred label: Myriapoda @en
type: Concept