پروسوبرانشیا
scope note: از شکم پایان دریایی که در آبهای شیرین زندگی می‌کنند
broader: شکم‌پایان
preferred label: Prosobranchia @en
type: Concept

شکم‌پایان
preferred label: Gastropoda @en
type: Concept
narrower: پروسوبرانشیا