دنتالیم
scope note: نام جنس نوعی نرم تن ناوی شکل دوران سوم و کنونی. گونه های مشابه آن در دونین شناخته شده است.
broader: ناوپایان
preferred label: dentalium @en
type: Concept

ناوپایان
preferred label: Scaphopoda @en
type: Concept
narrower: دنتالیم