بلور دگرگونی
scope note: بلور درشتی که براثر بازبلورش در یک سنگ دگرگونی تشکیل شده است
broader: بلور
preferred label: metacryst @en
type: Concept

بلور
preferred label: crystal @en
type: Concept
narrower: بلور دگرگونی