بلورهای میان‌انباشتی
scope note: بلورهایی که در طی بلورش جزءبه‌جزء، از ماگمای به‌دام‌افتاده در بین بلورهای اولیۀ انباشتی، تشکیل می‌شوند
broader: بلور
preferred label: intercumulus crystals @en
type: Concept

بلور
preferred label: crystal @en
type: Concept
narrower: بلورهای میان‌انباشتی