صفحه محوری
preferred label: axial plane @en
type: Concept
related: برگوارگی صفحه محوری

برگوارگی صفحه محوری
scope note: برگوارگی در سنگ‌ها که به موازات صفحۀ محوری چین توسعه یافته است
related: صفحه محوری
broader: برگوارگی
preferred label: axial plane foliation @en
type: Concept

برگوارگی
preferred label: foliation @en
type: Concept
narrower: برگوارگی صفحه محوری