بافت
preferred label: texture @en
type: Concept
narrower: بافت پورفیروبلاستیک

بافت پورفیروبلاستیک
alternative label: شکفته بلور
scope note: نوعی بافت دگرگونی که در آن بلورهای درشت سنگ دگرگونی بوسیله بلورهای کوچک آن کانی یا کانی دیگر احاطه شده است
related: سنگ دگرگونی
broader: بافت
preferred label: porphyroblastic texture @en
type: Concept

سنگ دگرگونی
preferred label: metamorphic rock @en
type: Concept
related: بافت پورفیروبلاستیک