بافت خال‌خال
scope note: بافت سنگ آذرینی که در آن دانه‌های کوچک یک کانی به‌طور نامنظم در بلور بزرگ‌تر و بی‌وجه کانی دیگری پخش شده‌اند
related: سنگ آذرین
broader: بافت
preferred label: poikilitic texture @en
type: Concept

سنگ آذرین
preferred label: igneous rock @en
type: Concept
related: بافت خال‌خال

بافت
preferred label: texture @en
type: Concept
narrower: بافت خال‌خال