بافت دانه‌ای
preferred label: granular texture @en
type: Concept
narrower: بافت دانه‌ای نیمه‌خودریخت

بافت دانه‌ای نیمه‌خودریخت
scope note: بافت آذرین ویدایی که بخش اعظم آن از دانه‌های هم‌اندازۀ نیمه‌خوش‌وجه تشکیل شده است
broader: بافت دانه‌ای
preferred label: hypidiomorphic-granular texture @en
type: Concept