بافت علفی
scope note: بافت آذرین آتشفشانی متشکل از بلورهای اولیوین و پیروکسن سوزنی‌شکل که الگویی چلیپایی دارد و در نتیجۀ سردایش سریع مواد در دماهای بالای غیرمعمول پدید می‌آید
related: سنگ آذرین
broader: بافت
preferred label: spinifex texture @en
type: Concept

سنگ آذرین
preferred label: igneous rock @en
type: Concept
related: بافت علفی

بافت
preferred label: texture @en
type: Concept
narrower: بافت علفی