بافت
preferred label: texture @en
type: Concept
narrower: بافت فلسی

بافت فلسی
scope note: بافت برخی از کانی‌ها که به‌صورت ورقه‌های هم‌پوشان است
broader: بافت
preferred label: imbricated texture @en
type: Concept