بافت
preferred label: texture @en
type: Concept
narrower: بافت نمدی

بافت نمدی
scope note: بافت ماگمایی تمام‌بلورین و ریزبلورین، شامل بلورهای کوچک درهم‌بافتۀ پلاژیوکلاز
broader: بافت
preferred label: pilotaxitic texture @en
type: Concept