بازمانده
scope note: ویژگی کانی یا ساختار یا سیمای یک سنگ قدیمی که، با وجود فرایندهای تخریب‌کننده، در سنگ جدید باقی مانده است
related: ماده باقیمانده
related: سنگ دگرگونی
preferred label: relict @en
type: Concept

ماده باقیمانده
preferred label: relict material @en
type: Concept
related: بازمانده

سنگ دگرگونی
preferred label: metamorphic rock @en
type: Concept
related: بازمانده