رودخانه ماگدالنا
preferred label: Magdalena River @en
type: Concept
related: دره ماگدالنا

کلمبیا
preferred label: Colombia @en
type: Concept
narrower: دره ماگدالنا

دره ماگدالنا
scope note: دره رودخانه‌ای که از شمال غرب تا جنوب غرب کلمبیا امتداد دارد.
related: رودخانه ماگدالنا
broader: کلمبیا
preferred label: Magdalena Valley @en
type: Concept