جزیره مارگاریت
scope note: در دریای کارائیب 15 مایلی ساحل جنوب شرقی.
broader: جزایر ونزوئلایی
preferred label: Margarita Island @en
type: Concept

جزایر ونزوئلایی
preferred label: Venezuelan Islands @en
type: Concept
narrower: جزیره مارگاریت