دره کافتی کنیا
scope note: بخشی از دره کافتی بزرگ در طول شمال و جنوب از طریق غرب مرکز کنیا.
related: دره کافتی بزرگ
broader: کنیا
preferred label: Kenya Rift valley @en
type: Concept

دره کافتی بزرگ
preferred label: Great Rift Valley @en
type: Concept
related: دره کافتی کنیا

کنیا
preferred label: Kenya @en
type: Concept
narrower: دره کافتی کنیا