الجزایر
preferred label: Algeria @en
type: Concept
narrower: ناحیه بابور

رشته‌کوه اطلس
preferred label: Atlas Mountains @en
type: Concept
related: ناحیه بابور

ناحیه بابور
scope note: منطقه ساحلی در رشته‌کوه های اطلس کوچک در شمال الجزایر
related: رشته‌کوه اطلس
broader: الجزایر
preferred label: Babor Range @en
type: Concept