سد آسوان
scope note: شامل سد بلند آسوان در رودخانه نیل که روی دریاچه ناصر در جنوب شرق مصر ایجاد شده است.
related: رود نیل
broader: مصر
preferred label: Aswan Dam @en
type: Concept

رود نیل
preferred label: Nile River @en
type: Concept
related: سد آسوان

مصر
preferred label: Egypt @en
type: Concept
narrower: سد آسوان