ونترسدروپ آفریقای جنوبی
scope note: شهری در نزدیکی کلرکسدروپ شمال مرکز آفریقای جنوبی
broader: آفریقای جنوبی
preferred label: ventersdorp South Africa @en
type: Concept

آفریقای جنوبی
preferred label: South Africa @en
type: Concept
narrower: ونترسدروپ آفریقای جنوبی