آفریقا
preferred label: Africa @en
type: Concept
narrower: سکوی آفریقا

سکوی آفریقا
scope note: یک سکوی وسیع تشکیل شده ار سنگهای پرکامبرین و پالئوروئیک و بصورت بخشی پوشیده از سنگهای رسوبی ترشیری و مزوزوئیک که تمام قاره را شامل می شود.
broader: آفریقا
preferred label: African Platform @en
type: Concept