حوضه تورگای
scope note: یک فرونشست کشیده که با زمینهای پست توران و سیبری مشارکت دارد
related: قزاقستان
broader: آسیای مرکزی
preferred label: Turgay Basin @en
type: Concept

قزاقستان
preferred label: Kazakhstan @en
type: Concept
related: حوضه تورگای

آسیای مرکزی
preferred label: Central Asia @en
type: Concept
narrower: حوضه تورگای