گوانگزی چین
preferred label: Guangxi China @en
type: Concept
narrower: گویلین

گویلین
scope note: ناحیه کارست احاطه‌کننده شهری در شمال شرق گوانگزی چین.
broader: گوانگزی چین
preferred label: Guilin @en
type: Concept