توکوشیما ژاپن
preferred label: Tokushima Japan @en
type: Concept
related: رودخانه یوشینو

رودخانه یوشینو
scope note: از کوههای شمال غرب آغاز و در جهت شرق به کانال کی در توکوشیما می‌ریزد
related: توکوشیما ژاپن
broader: شیکوکو
preferred label: yoshino River @en
type: Concept

شیکوکو
preferred label: Shikoku @en
type: Concept
narrower: رودخانه یوشینو