کویبالسان مغولستان
scope note: شهری در حاشیه رود کرولن در شرق مغولستان.
broader: مغولستان
preferred label: Choybalsan Mongolia @en
type: Concept

مغولستان
preferred label: Mongolia @en
type: Concept
narrower: کویبالسان مغولستان