اسرائیل
preferred label: Israel @en
type: Concept
narrower: خلیج حیفا

خلیج حیفا
scope note: شاخابه‌ای از دریای مدیترانه کناره ساحل جلیلی، شمال اسرائیل.
related: دریای مدیترانه
broader: اسرائیل
preferred label: Haifa Bay @en
type: Concept

دریای مدیترانه
preferred label: Mediterranean Sea @en
type: Concept
related: خلیج حیفا