آسیا
preferred label: Asia @en
type: Concept
narrower: رودخانه کوبان

فدراسیون روسیه
preferred label: Russian Federation @en
type: Concept
related: رودخانه کوبان

رودخانه کوبان
scope note: در جمهوری گرجستان در قفقاز منشاء گرفته به سوی دریای آزوو در جهت شمال و شمال غربی جریان دارد.
related: فدراسیون روسیه
broader: آسیا
preferred label: Kuban River @en
type: Concept