آسیا
preferred label: Asia @en
type: Concept
narrower: سرو فدراسیون روسیه

سرو فدراسیون روسیه
scope note: شهری در استان خودمختار یکاترینبرگ در شرق اورال
broader: آسیا
preferred label: Serov Russian Federation @en
type: Concept