یمن
preferred label: Yemen @en
type: Concept
narrower: یمن عدن

یمن عدن
alternative label: تحت‌الحمایه عدن
scope note: شهری در خلیج عدن، مهاجر نشینان انگلیسی سابق
broader: یمن
preferred label: Aden Yemen @en
type: Concept