جزایر بنگال
preferred label: Bengal Islands @en
type: Concept
narrower: جزایر نیکوبار

جزایر نیکوبار
scope note: گروه جزایر خلیج بنگال شمال غرب سوماترا، بخش جنوبی جزایر آندامن و نیکوبار را می سازد.
broader: جزایر بنگال
preferred label: Nicobar Islands @en
type: Concept