دهلی هند
scope note: ایالتی در شمال مرکز هند که شامل شهری در شمال شمال شرق دهلی نو میباشد.
narrower: دهلی نو هند
broader: هندوستان
preferred label: Delhi India @en
type: Concept

دهلی نو هند
preferred label: New Delhi India @en
type: Concept
broader: دهلی هند

هندوستان
preferred label: India @en
type: Concept
narrower: دهلی هند