بنگالور هند
scope note: شهر و ناحیه ای در جنوب شرق کاماتاکا، جنوب هند
broader: کارناتاکا هندوستان
preferred label: Bangalore India @en
type: Concept

کارناتاکا هندوستان
preferred label: Karnataka India @en
type: Concept
narrower: بنگالور هند