هیماکال پرادش هند
preferred label: Himachal Pradesh India @en
type: Concept
narrower: چامبا هند

چامبا هند
scope note: شهر و منطقه ای در شمال غرب هیماچال پرادش، شمال هند
broader: هیماکال پرادش هند
preferred label: Chamba India @en
type: Concept