ایزگونه
scope note: گروهی از ایزفسیل‌های متعلق به یک ایزسرده که دارای خصوصیات یکسان هستند
related: ایزسرده
related: ایزفسیل
preferred label: ichnospecies @en
type: Concept

ایزسرده
preferred label: ichnogenus @en
type: Concept
related: ایزگونه

ایزفسیل
preferred label: ichnofossil @en
type: Concept
related: ایزگونه