ایزفسیل
preferred label: ichnofossil @en
type: Concept
related: ایزآوار

ایزآوار
scope note: ایزفسیل‌هایی که موجودات دیگر آنها را تغییر داده‌اند
related: ایزفسیل
preferred label: ichnoclast @en
type: Concept