بلایا گورا فدراسیون روسیه
scope note: روستایی در جنوب آرخانگسیک در ایالت خود مختار آرخانگسیک در شمال غرب فدراسیون روسیه (هم چنین در جاهای دیگر نیز ممکن است باشد)
related: آرخان گلسک فدراسیون روسیه
broader: فدراسیون روسیه
preferred label: Belaya Gora Russian Federation @en
type: Concept

آرخان گلسک فدراسیون روسیه
preferred label: Arkhangelsk Russian Federation @en
type: Concept
related: بلایا گورا فدراسیون روسیه

فدراسیون روسیه
preferred label: Russian Federation @en
type: Concept
narrower: بلایا گورا فدراسیون روسیه