کومونار فدراسیون روسیه
scope note: شهری در ناحیه خودمختار خاکاس در جنوب غرب کراسنویارسک کرای. شاید در محل‌های دیگری نیز واقع شده باشد.
related: کراسنویارسک فدراسیون روسیه
broader: فدراسیون روسیه
preferred label: Kommunar Russian Federation @en
type: Concept

کراسنویارسک فدراسیون روسیه
preferred label: krasnoyarsk Russian Federation @en
type: Concept
related: کومونار فدراسیون روسیه

فدراسیون روسیه
preferred label: Russian Federation @en
type: Concept
narrower: کومونار فدراسیون روسیه