اورگان
preferred label: Oregon @en
type: Concept
narrower: نیوپورت اورگان

نیوپورت اورگان
scope note: شهری در کناره اقیانوس آرام در غرب اورگان.
broader: اورگان
preferred label: Newport Oregon @en
type: Concept