جزیره آداک
scope note: در بخش مرکزی جزایر آلوسین جنوب غرب شبه جزیره آلاسکا
broader: آلاسکای جنوب غربی
preferred label: Adak Island @en
type: Concept

آلاسکای جنوب غربی
preferred label: Southwestern Alaska @en
type: Concept
narrower: جزیره آداک